Reaction Details
TargetOrexin/Hypocretin receptor type 1
LigandBDBM50093795
Substrate/Competitorn/a
Meas. Tech.ChEMBL_1502024 (CHEMBL3588583)
Ki 3.0±n/a nM
Citation Yoshida, YNaoe, YTerauchi, TOzaki, FDoko, TTakemura, ATanaka, TSorimachi, KBeuckmann, CTSuzuki, MUeno, TOzaki, SYonaga, M Discovery of (1R,2S)-2-{[(2,4-Dimethylpyrimidin-5-yl)oxy]methyl}-2-(3-fluorophenyl)-N-(5-fluoropyridin-2-yl)cyclopropanecarboxamide (E2006): A Potent and Efficacious Oral Orexin Receptor Antagonist. J Med Chem58:4648-64 (2015) 
 
Orexin/Hypocretin receptor type 1
Name:Orexin/Hypocretin receptor type 1
Type:Protein
Mol. Mass.:47554.50
Organism:Homo sapiens (Human)
Description:O43613
Residue:425
BDBM50093795
NameBDBM50093795
Synonyms:CHEMBL3585952
TypeSmall organic molecule
Emp. Form.C23H23FN4O3
Mol. Mass.422.4521
SMILESCOc1cc(NC(=O)[C@@H]2C[C@@]2(COc2cnc(C)nc2C)c2ccccc2)ncc1F