Reaction Details
TargetOrexin/Hypocretin receptor type 1
LigandBDBM50093791
Substrate/Competitorn/a
Meas. Tech.ChEMBL_1502024 (CHEMBL3588583)
Ki 7.0±n/a nM
Citation Yoshida, YNaoe, YTerauchi, TOzaki, FDoko, TTakemura, ATanaka, TSorimachi, KBeuckmann, CTSuzuki, MUeno, TOzaki, SYonaga, M Discovery of (1R,2S)-2-{[(2,4-Dimethylpyrimidin-5-yl)oxy]methyl}-2-(3-fluorophenyl)-N-(5-fluoropyridin-2-yl)cyclopropanecarboxamide (E2006): A Potent and Efficacious Oral Orexin Receptor Antagonist. J Med Chem58:4648-64 (2015) 
 
Orexin/Hypocretin receptor type 1
Name:Orexin/Hypocretin receptor type 1
Type:Protein
Mol. Mass.:47554.50
Organism:Homo sapiens (Human)
Description:O43613
Residue:425
BDBM50093791
NameBDBM50093791
Synonyms:CHEMBL3585955
TypeSmall organic molecule
Emp. Form.C22H19F3N4O2
Mol. Mass.428.4071
SMILESCc1ncc(OC[C@]2(C[C@H]2C(=O)Nc2ccc(F)cn2)c2cc(F)cc(F)c2)c(C)n1