Reaction Details
TargetOrexin/Hypocretin receptor type 1
LigandBDBM50093815
Substrate/Competitorn/a
Meas. Tech.ChEMBL_1502024 (CHEMBL3588583)
Ki 39±n/a nM
Citation Yoshida, YNaoe, YTerauchi, TOzaki, FDoko, TTakemura, ATanaka, TSorimachi, KBeuckmann, CTSuzuki, MUeno, TOzaki, SYonaga, M Discovery of (1R,2S)-2-{[(2,4-Dimethylpyrimidin-5-yl)oxy]methyl}-2-(3-fluorophenyl)-N-(5-fluoropyridin-2-yl)cyclopropanecarboxamide (E2006): A Potent and Efficacious Oral Orexin Receptor Antagonist. J Med Chem58:4648-64 (2015) 
 
Orexin/Hypocretin receptor type 1
Name:Orexin/Hypocretin receptor type 1
Type:Protein
Mol. Mass.:47554.50
Organism:Homo sapiens (Human)
Description:O43613
Residue:425
BDBM50093815
NameBDBM50093815
Synonyms:CHEMBL3585948
TypeSmall organic molecule
Emp. Form.C22H21ClN4O2
Mol. Mass.408.881
SMILESCc1ncc(OC[C@]2(C[C@H]2C(=O)Nc2ccc(Cl)cn2)c2ccccc2)c(C)n1