Reaction Details
TargetFormyl peptide receptor-related sequence 1
LigandBDBM50097569
Substrate/Competitorn/a
Meas. Tech.ChEMBL_1504350 (CHEMBL3592687)
EC50 2300±n/a nM
Citation Lacivita, ESchepetkin, IAStama, MLKirpotina, LNColabufo, NAPerrone, RKhlebnikov, AIQuinn, MTLeopoldo, M Novel 3-(1H-indol-3-yl)-2-[3-(4-methoxyphenyl)ureido]propanamides as selective agonists of human formyl-peptide receptor 2. Bioorg Med Chem23:3913-24 (2015) 
 
Formyl peptide receptor-related sequence 1
Name:Formyl peptide receptor-related sequence 1
Type:PROTEIN
Mol. Mass.:39532.25
Organism:Mus musculus
Description:ChEMBL_109574
Residue:351
BDBM50097569
NameBDBM50097569
Synonyms:CHEMBL3590075
TypeSmall organic molecule
Emp. Form.C32H35FN4O3
Mol. Mass.542.6437
SMILESCOc1ccc(NC(=O)N[C@@H](Cc2c[nH]c3ccccc23)C(=O)NCC2(CCCCC2)c2ccc(F)cc2)cc1