Reaction Details
TargetN-formyl peptide receptor 2
LigandBDBM50097567
Substrate/Competitorn/a
Meas. Tech.ChEMBL_1504346 (CHEMBL3592683)
EC50 64±n/a nM
Citation Lacivita, ESchepetkin, IAStama, MLKirpotina, LNColabufo, NAPerrone, RKhlebnikov, AIQuinn, MTLeopoldo, M Novel 3-(1H-indol-3-yl)-2-[3-(4-methoxyphenyl)ureido]propanamides as selective agonists of human formyl-peptide receptor 2. Bioorg Med Chem23:3913-24 (2015) 
 
N-formyl peptide receptor 2
Name:N-formyl peptide receptor 2
Type:G Protein-Coupled Receptor (GPCR)
Mol. Mass.:38968.35
Organism:Homo sapiens (Human)
Description:P25090
Residue:351
BDBM50097567
NameBDBM50097567
Synonyms:CHEMBL3588871
TypeSmall organic molecule
Emp. Form.C32H37N5O4
Mol. Mass.555.6673
SMILESCOc1ccc(NC(=O)N[C@@H](Cc2c[nH]c3ccccc23)C(=O)NCC2(CCCCC2)c2ccc(OC)cn2)cc1