Reaction Details
TargetMitogen-activated protein kinase 1
LigandBDBM50094467
Substrate/Competitorn/a
Meas. Tech.ChEMBL_1503902 (CHEMBL3593135)
IC50 90±n/a nM
Citation Ward, RAColclough, NChallinor, MDebreczeni, JEEckersley, KFairley, GFeron, LFlemington, VGraham, MAGreenwood, RHopcroft, PHoward, TDJames, MJones, CDJones, CRRenshaw, JRoberts, KSnow, LTonge, MYeung, K Structure-Guided Design of Highly Selective and Potent Covalent Inhibitors of ERK1/2. J Med Chem58:4790-801 (2015) 
 
Mitogen-activated protein kinase 1
Name:Mitogen-activated protein kinase 1
Type:Ser/Thr Protein Kinase
Mol. Mass.:41392.76
Organism:Homo sapiens (Human)
Description:P28482
Residue:360
BDBM50094467
NameBDBM50094467
Synonyms:CHEMBL3590124
TypeSmall organic molecule
Emp. Form.C21H27ClN6O
Mol. Mass.414.932
SMILESCN(C)[C@H]1CC[C@@H](CC1)Nc1ncc(Cl)c(Nc2ccccc2NC(=O)C=C)n1