Reaction Details
TargetMitogen-activated protein kinase 1
LigandBDBM50094305
Substrate/Competitorn/a
Meas. Tech.ChEMBL_1503902 (CHEMBL3593135)
IC50 60±n/a nM
Citation Ward, RAColclough, NChallinor, MDebreczeni, JEEckersley, KFairley, GFeron, LFlemington, VGraham, MAGreenwood, RHopcroft, PHoward, TDJames, MJones, CDJones, CRRenshaw, JRoberts, KSnow, LTonge, MYeung, K Structure-Guided Design of Highly Selective and Potent Covalent Inhibitors of ERK1/2. J Med Chem58:4790-801 (2015) 
 
Mitogen-activated protein kinase 1
Name:Mitogen-activated protein kinase 1
Type:Ser/Thr Protein Kinase
Mol. Mass.:41392.76
Organism:Homo sapiens (Human)
Description:P28482
Residue:360
BDBM50094305
NameBDBM50094305
Synonyms:CHEMBL3590117
TypeSmall organic molecule
Emp. Form.C19H21ClN4O2
Mol. Mass.372.849
SMILESClc1cnc(NC2CCOCC2)cc1Nc1ccccc1NC(=O)C=C