Reaction Details
TargetMitogen-activated protein kinase 1
LigandBDBM50094313
Substrate/Competitorn/a
Meas. Tech.ChEMBL_1503902 (CHEMBL3593135)
IC50 220±n/a nM
Citation Ward, RAColclough, NChallinor, MDebreczeni, JEEckersley, KFairley, GFeron, LFlemington, VGraham, MAGreenwood, RHopcroft, PHoward, TDJames, MJones, CDJones, CRRenshaw, JRoberts, KSnow, LTonge, MYeung, K Structure-Guided Design of Highly Selective and Potent Covalent Inhibitors of ERK1/2. J Med Chem58:4790-801 (2015) 
 
Mitogen-activated protein kinase 1
Name:Mitogen-activated protein kinase 1
Type:Ser/Thr Protein Kinase
Mol. Mass.:41392.76
Organism:Homo sapiens (Human)
Description:P28482
Residue:360
BDBM50094313
NameBDBM50094313
Synonyms:CHEMBL3590109
TypeSmall organic molecule
Emp. Form.C14H20N4O3S
Mol. Mass.324.399
SMILESC=CS(=O)(=O)N1CCc2cnc(NC3CCOCC3)nc2C1