Reaction Details
TargetMitogen-activated protein kinase 1
LigandBDBM50094469
Substrate/Competitorn/a
Meas. Tech.ChEMBL_1503901 (CHEMBL3593134)
IC50 77±n/a nM
Citation Ward, RAColclough, NChallinor, MDebreczeni, JEEckersley, KFairley, GFeron, LFlemington, VGraham, MAGreenwood, RHopcroft, PHoward, TDJames, MJones, CDJones, CRRenshaw, JRoberts, KSnow, LTonge, MYeung, K Structure-Guided Design of Highly Selective and Potent Covalent Inhibitors of ERK1/2. J Med Chem58:4790-801 (2015) 
 
Mitogen-activated protein kinase 1
Name:Mitogen-activated protein kinase 1
Type:Ser/Thr Protein Kinase
Mol. Mass.:41392.76
Organism:Homo sapiens (Human)
Description:P28482
Residue:360
BDBM50094469
NameBDBM50094469
Synonyms:CHEMBL3590122
TypeSmall organic molecule
Emp. Form.C19H23N5O2
Mol. Mass.353.4182
SMILESCc1cnc(NC2CCOCC2)nc1Nc1ccccc1NC(=O)C=C