Reaction Details
TargetMitogen-activated protein kinase 1
LigandBDBM50094471
Substrate/Competitorn/a
Meas. Tech.ChEMBL_1503901 (CHEMBL3593134)
IC50 3.1±n/a nM
Citation Ward, RAColclough, NChallinor, MDebreczeni, JEEckersley, KFairley, GFeron, LFlemington, VGraham, MAGreenwood, RHopcroft, PHoward, TDJames, MJones, CDJones, CRRenshaw, JRoberts, KSnow, LTonge, MYeung, K Structure-Guided Design of Highly Selective and Potent Covalent Inhibitors of ERK1/2. J Med Chem58:4790-801 (2015) 
 
Mitogen-activated protein kinase 1
Name:Mitogen-activated protein kinase 1
Type:Ser/Thr Protein Kinase
Mol. Mass.:41392.76
Organism:Homo sapiens (Human)
Description:P28482
Residue:360
BDBM50094471
NameBDBM50094471
Synonyms:CHEMBL3590120
TypeSmall organic molecule
Emp. Form.C17H19ClN6O2
Mol. Mass.374.825
SMILESClc1cnc(NC2CCOCC2)nc1Nc1ccncc1NC(=O)C=C