Reaction Details
TargetCatenin beta-1
LigandBDBM50014132
Substrate/Competitorn/a
Meas. Tech.ChEMBL_1504364 (CHEMBL3592701)
Ki 3100±n/a nM
Citation Catrow, JLZhang, YZhang, MJi, H Discovery of Selective Small-Molecule Inhibitors for the฿-Catenin/T-Cell Factor Protein-Protein Interaction through the Optimization of the Acyl Hydrazone Moiety. J Med Chem58:4678-92 (2015) 
 
Catenin beta-1
Name:Catenin beta-1
Type:PROTEIN
Mol. Mass.:85484.08
Organism:Homo sapiens (Human)
Description:ChEMBL_1504364
Residue:781
BDBM50014132
NameBDBM50014132
Synonyms:CHEMBL2323032
TypeSmall organic molecule
Emp. Form.C10H10N6O
Mol. Mass.230.226
SMILESOn1ncc2cc(CCc3nn[nH]n3)ccc12