Reaction Details
TargetCatenin beta-1
LigandBDBM50094597
Substrate/Competitorn/a
Meas. Tech.ChEMBL_1504365 (CHEMBL3592702)
Ki 21000±n/a nM
Citation Catrow, JLZhang, YZhang, MJi, H Discovery of Selective Small-Molecule Inhibitors for the฿-Catenin/T-Cell Factor Protein-Protein Interaction through the Optimization of the Acyl Hydrazone Moiety. J Med Chem58:4678-92 (2015) 
 
Catenin beta-1
Name:Catenin beta-1
Type:PROTEIN
Mol. Mass.:85484.08
Organism:Homo sapiens (Human)
Description:ChEMBL_1504364
Residue:781
BDBM50094597
NameBDBM50094597
Synonyms:CHEMBL2323028
TypeSmall organic molecule
Emp. Form.C16H10ClNO4
Mol. Mass.315.708
SMILESOC(=O)c1cc(on1)-c1ccc(Oc2ccc(Cl)cc2)cc1