Reaction Details
TargetCatenin beta-1
LigandBDBM50094509
Substrate/Competitorn/a
Meas. Tech.ChEMBL_1504365 (CHEMBL3592702)
Ki 120000±n/a nM
Citation Catrow, JLZhang, YZhang, MJi, H Discovery of Selective Small-Molecule Inhibitors for the฿-Catenin/T-Cell Factor Protein-Protein Interaction through the Optimization of the Acyl Hydrazone Moiety. J Med Chem58:4678-92 (2015) 
 
Catenin beta-1
Name:Catenin beta-1
Type:PROTEIN
Mol. Mass.:85484.08
Organism:Homo sapiens (Human)
Description:ChEMBL_1504364
Residue:781
BDBM50094509
NameBDBM50094509
Synonyms:CHEMBL3589020
TypeSmall organic molecule
Emp. Form.C10H5N5O
Mol. Mass.211.1796
SMILESc1ccc2c(c1)[nH]c1nc3nonc3nc21