Reaction Details
TargetCatenin beta-1
LigandBDBM50094490
Substrate/Competitorn/a
Meas. Tech.ChEMBL_1504390 (CHEMBL3592843)
Ki 59000±n/a nM
Citation Catrow, JLZhang, YZhang, MJi, H Discovery of Selective Small-Molecule Inhibitors for the฿-Catenin/T-Cell Factor Protein-Protein Interaction through the Optimization of the Acyl Hydrazone Moiety. J Med Chem58:4678-92 (2015) 
 
Catenin beta-1
Name:Catenin beta-1
Type:PROTEIN
Mol. Mass.:85484.08
Organism:Homo sapiens (Human)
Description:ChEMBL_1504364
Residue:781
BDBM50094490
NameBDBM50094490
Synonyms:CHEMBL3589156
TypeSmall organic molecule
Emp. Form.C14H11N5O3
Mol. Mass.297.2688
SMILESOC(=O)CCCn1c2ccccc2c2nc3nonc3nc12