Reaction Details
TargetGhrelin O-acyltransferase
LigandBDBM50094875
Substrate/Competitorn/a
Meas. Tech.ChEMBL_1502747 (CHEMBL3590857)
IC50>1000±n/a nM
Citation Zhao, FDarling, JEGibbs, RAHougland, JL A new class of ghrelin O-acyltransferase inhibitors incorporating triazole-linked lipid mimetic groups. Bioorg Med Chem Lett25:2800-3 (2015) 
 
Ghrelin O-acyltransferase
Name:Ghrelin O-acyltransferase
Type:Enzyme
Mol. Mass.:49733.10
Organism:Homo sapiens (Human)
Description:Q96T53
Residue:435
BDBM50094875
NameBDBM50094875
Synonyms:CHEMBL3589130
TypeSmall organic molecule
Emp. Form.C35H49N9O6
Mol. Mass.691.8203
SMILESCC(C)C[C@H](NC(=O)[C@H](Cc1ccccc1)NC(=O)[C@H](Cn1cc(CCCCc2ccccc2)nn1)NC(=O)[C@H](CO)NC(=O)CN)C(N)=O