Reaction Details
TargetPoly [ADP-ribose] polymerase tankyrase-1
LigandBDBM50094922
Substrate/Competitorn/a
Meas. Tech.ChEMBL_1502965 (CHEMBL3591899)
IC50 5000±n/a nM
Citation Kumpan, KNathubhai, AZhang, CWood, PJLloyd, MDThompson, ASHaikarainen, TLehtiö, LThreadgill, MD Structure-based design, synthesis and evaluation in vitro of arylnaphthyridinones, arylpyridopyrimidinones and their tetrahydro derivatives as inhibitors of the tankyrases. Bioorg Med Chem23:3013-32 (2015) 
 
Poly [ADP-ribose] polymerase tankyrase-1
Name:Poly [ADP-ribose] polymerase tankyrase-1
Type:Enzyme
Mol. Mass.:142058.03
Organism:Homo sapiens (Human)
Description:O95271
Residue:1327
BDBM50094922
NameBDBM50094922
Synonyms:CHEMBL3589247
TypeSmall organic molecule
Emp. Form.C14H10N2O
Mol. Mass.222.242
SMILESO=c1[nH]c(cc2ncccc12)-c1ccccc1