Reaction Details
TargetPoly [ADP-ribose] polymerase tankyrase-1
LigandBDBM50094928
Substrate/Competitorn/a
Meas. Tech.ChEMBL_1502965 (CHEMBL3591899)
IC50 21±n/a nM
Citation Kumpan, KNathubhai, AZhang, CWood, PJLloyd, MDThompson, ASHaikarainen, TLehtiö, LThreadgill, MD Structure-based design, synthesis and evaluation in vitro of arylnaphthyridinones, arylpyridopyrimidinones and their tetrahydro derivatives as inhibitors of the tankyrases. Bioorg Med Chem23:3013-32 (2015) 
 
Poly [ADP-ribose] polymerase tankyrase-1
Name:Poly [ADP-ribose] polymerase tankyrase-1
Type:Enzyme
Mol. Mass.:142058.03
Organism:Homo sapiens (Human)
Description:O95271
Residue:1327
BDBM50094928
NameBDBM50094928
Synonyms:CHEMBL3589284
TypeSmall organic molecule
Emp. Form.C15H15ClN2O
Mol. Mass.274.745
SMILESCN1CCCc2c1cc([nH]c2=O)-c1ccc(Cl)cc1