Reaction Details
TargetBeta-secretase 2
LigandBDBM50094976
Substrate/Competitorn/a
Meas. Tech.ChEMBL_1503096 (CHEMBL3592346)
Ki 7.3±n/a nM
Citation Vila-Real, HCoelho, HRocha, JFernandes, AVentura, MRMaycock, CDIranzo, OSimplício, AL Peptidomimeticß-Secretase Inhibitors Comprising a Sequence of Amyloid-ß Peptide for Alzheimer's Disease. J Med Chem58:5408-18 (2015) 
 
Beta-secretase 2
Name:Beta-secretase 2
Type:Protein
Mol. Mass.:56171.20
Organism:Homo sapiens (Human)
Description:Q9Y5Z0
Residue:518
BDBM50094976
NameBDBM50094976
Synonyms:CHEMBL3588999
TypeSmall organic molecule
Emp. Form.C60H89N11O19
Mol. Mass.1268.411
SMILESCC(C)C[C@H](NC(=O)[C@H](CC(O)=O)NC(=O)[C@H](CC(C)C)NC(=O)[C@@H](N)CCC(O)=O)[C@@H](O)C[C@@H](C)C(=O)N[C@@H](C(C)C)C(=O)N[C@@H](Cc1ccccc1)C(=O)N[C@@H](Cc1ccccc1)C(=O)N[C@@H](C)C(=O)N[C@@H](CCC(O)=O)C(=O)N[C@@H](CC(O)=O)C(N)=O