Reaction Details
TargetVesicular acetylcholine transporter
LigandBDBM50018094
Substrate/Competitorn/a
Meas. Tech.ChEMBL_1503352 (CHEMBL3590743)
Ki 1.000000±n/a nM
Citation Barthel, CSorger, DDeuther-Conrad, WScheunemann, MSchweiger, SJäckel, PRoghani, ASteinbach, JSchüürmann, GSabri, OBrust, PWenzel, B New systematically modified vesamicol analogs and their affinity and selectivity for the vesicular acetylcholine transporter - A critical examination of the lead structure. Eur J Med Chem100:50-67 (2015) 
 
Vesicular acetylcholine transporter
Name:Vesicular acetylcholine transporter
Type:PROTEIN
Mol. Mass.:56111.93
Organism:Torpedo californica
Description:ChEMBL_1503355
Residue:515
BDBM50018094
NameBDBM50018094
Synonyms:(1R,2R)-2-(4-Phenyl-piperidin-1-yl)-cyclohexanol 2-(4-Phenyl-piperidin-1-yl)-cyclohexanol(Vesamicol) Vesamicol | trans-2-(4-phenylpiperidin-1-yl)cyclohexanol
TypeSmall organic molecule
Emp. Form.C17H25NO
Mol. Mass.259.3865
SMILESO[C@@H]1CCCC[C@H]1N1CCC(CC1)c1ccccc1