Reaction Details
TargetVesicular acetylcholine transporter
LigandBDBM50039613
Substrate/Competitorn/a
Meas. Tech.ChEMBL_1503355 (CHEMBL3590746)
Ki 0.055000±n/a nM
Citation Barthel, CSorger, DDeuther-Conrad, WScheunemann, MSchweiger, SJäckel, PRoghani, ASteinbach, JSchüürmann, GSabri, OBrust, PWenzel, B New systematically modified vesamicol analogs and their affinity and selectivity for the vesicular acetylcholine transporter - A critical examination of the lead structure. Eur J Med Chem100:50-67 (2015) 
 
Vesicular acetylcholine transporter
Name:Vesicular acetylcholine transporter
Type:PROTEIN
Mol. Mass.:56111.93
Organism:Torpedo californica
Description:ChEMBL_1503355
Residue:515
BDBM50039613
NameBDBM50039613
Synonyms:(2R,3R)-3-(4-Phenyl-piperidin-1-yl)-1,2,3,4-tetrahydro-naphthalen-2-ol CHEMBL87379 | trans-3-(4-phenylpiperidin-1-yl)-1,2,3,4-tetrahydronaphthalen-2-ol
TypeSmall organic molecule
Emp. Form.C21H25NO
Mol. Mass.307.4293
SMILESO[C@@H]1Cc2ccccc2C[C@H]1N1CCC(CC1)c1ccccc1