Reaction Details
TargetDNA gyrase subunit A/B
LigandBDBM50095211
Substrate/Competitorn/a
Meas. Tech.ChEMBL_1503691 (CHEMBL3592252)
Kd 49±n/a nM
Citation Toma?ic, TKatsamakas, SHodnik, ?Ila?, JBrvar, MSolmajer, TMontalvão, STammela, PBanjanac, MErgovic, GAnderluh, MPeterlin Ma?ic, LKikelj, D Discovery of 4,5,6,7-Tetrahydrobenzo[1,2-d]thiazoles as Novel DNA Gyrase Inhibitors Targeting the ATP-Binding Site. J Med Chem58:5501-21 (2015) 
 
DNA gyrase subunit A/B
Name:DNA gyrase subunit A/B
Type:A2B2 tetramer
Mol. Mass.:n/a
Description:n/a
Components:This complex has 2 components.
Component 1
Name:DNA gyrase subunit A
Synonyms:DNA gyrase GYRA_ECOLI hisW parD
Type:Enzyme Subunit
Mol. Mass.:96935.15
Organism:Escherichia coli (strain K12)
Description:n/a
Residue:875
Component 2
Name:DNA gyrase subunit B
Synonyms:DNA gyrase subunit B GYRB_ECOLI acrB gyrB hisU parA | pcbA
Type:Enzyme Subunit
Mol. Mass.:89941.28
Organism:Escherichia coli (strain K12)
Description:P0AES6
Residue:804
BDBM50095211
NameBDBM50095211
Synonyms:CHEMBL3589079
TypeSmall organic molecule
Emp. Form.C15H14Cl2N4O4S
Mol. Mass.417.267
SMILESOC(=O)CC(=O)Nc1nc2CC[C@@H](Cc2s1)NC(=O)c1cc(Cl)c(Cl)[nH]1