Reaction Details
TargetProstaglandin E2 receptor EP3 subtype
LigandBDBM50095296
Substrate/Competitorn/a
Meas. Tech.ChEMBL_1503717 (CHEMBL3592388)
Ki 2.0±n/a nM
Citation Abdel-Magid, AF Prostaglandin EP3 Receptor Antagonists May Provide Novel Treatment for Diabetes. ACS Med Chem Lett6:626-7 (2015) 
 
Prostaglandin E2 receptor EP3 subtype
Name:Prostaglandin E2 receptor EP3 subtype
Type:Enzyme
Mol. Mass.:43335.03
Organism:Homo sapiens (Human)
Description:P43115
Residue:390
BDBM50095296
NameBDBM50095296
Synonyms:CHEMBL3589082 | US9278953, 1
TypeSmall organic molecule
Emp. Form.C20H21FN4O2
Mol. Mass.368.4047
SMILESCCn1ncc2c(F)cc(cc12)-c1ccc(c(=O)[nH]1)[C@@]1(C)CCCNC1=O