Reaction Details
TargetVoltage-dependent T-type calcium channel subunit alpha-1H
LigandBDBM50095309
Substrate/Competitorn/a
Meas. Tech.ChEMBL_1503812 (CHEMBL3592796)
IC50 7600±n/a nM
Citation Zhang, QXia, ZJoshi, SScott, VEJarvis, MF Optimization of ADME Properties for Sulfonamides Leading to the Discovery of a T-Type Calcium Channel Blocker, ABT-639. ACS Med Chem Lett6:641-4 (2015) 
 
Voltage-dependent T-type calcium channel subunit alpha-1H
Name:Voltage-dependent T-type calcium channel subunit alpha-1H
Type:PROTEIN
Mol. Mass.:261134.29
Organism:Rattus norvegicus
Description:ChEMBL_18074
Residue:2359
BDBM50095309
NameBDBM50095309
Synonyms:CHEMBL3589557
TypeSmall organic molecule
Emp. Form.C20H21Cl2F2N3O3S
Mol. Mass.492.367
SMILESCl.[H][C@]12CCCN1CCN(C2)C(=O)c1cc(c(F)cc1Cl)S(=O)(=O)Nc1ccccc1F