Reaction Details
TargetSodium channel protein type 10 subunit alpha
LigandBDBM50095312
Substrate/Competitorn/a
Meas. Tech.ChEMBL_1503969 (CHEMBL3590899)
IC50 260±n/a nM
Citation Bagal, SKBungay, PJDenton, SMGibson, KRGlossop, MSHay, TLKemp, MILane, CALewis, MLMaw, GNMillion, WAPayne, CEPoinsard, CRawson, DJStammen, BLStevens, EBThompson, LR Discovery and Optimization of Selective Nav1.8 Modulator Series That Demonstrate Efficacy in Preclinical Models of Pain. ACS Med Chem Lett6:650-4 (2015) 
 
Sodium channel protein type 10 subunit alpha
Name:Sodium channel protein type 10 subunit alpha
Type:Enzyme
Mol. Mass.:220609.21
Organism:Homo sapiens (Human)
Description:Q9Y5Y9
Residue:1956
BDBM50095312
NameBDBM50095312
Synonyms:CHEMBL2324355
TypeSmall organic molecule
Emp. Form.C17H13F3N4O3
Mol. Mass.378.3053
SMILESCc1nocc1C(=O)Nc1ccc(c(N)n1)-c1ccccc1OC(F)(F)F