Reaction Details
TargetProtein arginine N-methyltransferase 8
LigandBDBM50095352
Substrate/Competitorn/a
Meas. Tech.ChEMBL_1504109 (CHEMBL3591483)
IC50 22±n/a nM
Citation Mitchell, LHDrew, AERibich, SARioux, NSwinger, KKJacques, SLLingaraj, TBoriack-Sjodin, PAWaters, NJWigle, TJMoradei, OJin, LRiera, TPorter-Scott, MMoyer, MPSmith, JJChesworth, RCopeland, RA Aryl Pyrazoles as Potent Inhibitors of Arginine Methyltransferases: Identification of the First PRMT6 Tool Compound. ACS Med Chem Lett6:655-9 (2015) 
 
Protein arginine N-methyltransferase 8
Name:Protein arginine N-methyltransferase 8
Type:Protein
Mol. Mass.:45293.70
Organism:Homo sapiens (Human)
Description:n/a
Residue:394
BDBM50095352
NameBDBM50095352
Synonyms:CHEMBL3589032
TypeSmall organic molecule
Emp. Form.C18H27ClN4O
Mol. Mass.350.886
SMILESCNCCN(C)Cc1cnn(C)c1-c1ccc(OC(C)C)c(Cl)c1