Reaction Details
TargetProtein arginine N-methyltransferase 8
LigandBDBM50095356
Substrate/Competitorn/a
Meas. Tech.ChEMBL_1504109 (CHEMBL3591483)
IC50 10.0±n/a nM
Citation Mitchell, LHDrew, AERibich, SARioux, NSwinger, KKJacques, SLLingaraj, TBoriack-Sjodin, PAWaters, NJWigle, TJMoradei, OJin, LRiera, TPorter-Scott, MMoyer, MPSmith, JJChesworth, RCopeland, RA Aryl Pyrazoles as Potent Inhibitors of Arginine Methyltransferases: Identification of the First PRMT6 Tool Compound. ACS Med Chem Lett6:655-9 (2015) 
 
Protein arginine N-methyltransferase 8
Name:Protein arginine N-methyltransferase 8
Type:Protein
Mol. Mass.:45293.70
Organism:Homo sapiens (Human)
Description:n/a
Residue:394
BDBM50095356
NameBDBM50095356
Synonyms:CHEMBL3589028
TypeSmall organic molecule
Emp. Form.C17H26N4
Mol. Mass.286.4151
SMILESCC(C)Cc1ccc(cc1)-c1[nH]ncc1CN(C)CCN