Reaction Details
TargetProtein arginine N-methyltransferase 8
LigandBDBM50095432
Substrate/Competitorn/a
Meas. Tech.ChEMBL_1504109 (CHEMBL3591483)
IC50 10.0±n/a nM
Citation Mitchell, LHDrew, AERibich, SARioux, NSwinger, KKJacques, SLLingaraj, TBoriack-Sjodin, PAWaters, NJWigle, TJMoradei, OJin, LRiera, TPorter-Scott, MMoyer, MPSmith, JJChesworth, RCopeland, RA Aryl Pyrazoles as Potent Inhibitors of Arginine Methyltransferases: Identification of the First PRMT6 Tool Compound. ACS Med Chem Lett6:655-9 (2015) 
 
Protein arginine N-methyltransferase 8
Name:Protein arginine N-methyltransferase 8
Type:Protein
Mol. Mass.:45293.70
Organism:Homo sapiens (Human)
Description:n/a
Residue:394
BDBM50095432
NameBDBM50095432
Synonyms:CHEMBL3589026
TypeSmall organic molecule
Emp. Form.C16H24N4O
Mol. Mass.288.388
SMILESCC(C)Oc1ccc(cc1)-c1[nH]ncc1CN(C)CCN