Reaction Details
TargetProtein arginine N-methyltransferase 6
LigandBDBM50095434
Substrate/Competitorn/a
Meas. Tech.ChEMBL_1504108 (CHEMBL3591482)
IC50 11±n/a nM
Citation Mitchell, LHDrew, AERibich, SARioux, NSwinger, KKJacques, SLLingaraj, TBoriack-Sjodin, PAWaters, NJWigle, TJMoradei, OJin, LRiera, TPorter-Scott, MMoyer, MPSmith, JJChesworth, RCopeland, RA Aryl Pyrazoles as Potent Inhibitors of Arginine Methyltransferases: Identification of the First PRMT6 Tool Compound. ACS Med Chem Lett6:655-9 (2015) 
 
Protein arginine N-methyltransferase 6
Name:Protein arginine N-methyltransferase 6
Type:Protein
Mol. Mass.:41928.48
Organism:Homo sapiens (Human)
Description:n/a
Residue:375
BDBM50095434
NameBDBM50095434
Synonyms:CHEMBL3589912
TypeSmall organic molecule
Emp. Form.C13H17FN4
Mol. Mass.248.2993
SMILESCN(CCN)Cc1cn[nH]c1-c1ccc(F)cc1