Reaction Details
TargetProtein arginine N-methyltransferase 1 [11-371]
LigandBDBM50095440
Substrate/Competitorn/a
Meas. Tech.ChEMBL_1504110 (CHEMBL3591484)
IC50 117±n/a nM
Citation Mitchell, LHDrew, AERibich, SARioux, NSwinger, KKJacques, SLLingaraj, TBoriack-Sjodin, PAWaters, NJWigle, TJMoradei, OJin, LRiera, TPorter-Scott, MMoyer, MPSmith, JJChesworth, RCopeland, RA Aryl Pyrazoles as Potent Inhibitors of Arginine Methyltransferases: Identification of the First PRMT6 Tool Compound. ACS Med Chem Lett6:655-9 (2015) 
 
Protein arginine N-methyltransferase 1 [11-371]
Name:Protein arginine N-methyltransferase 1 [11-371]
Type:Protein
Mol. Mass.:41506.52
Organism:Homo sapiens (Human)
Description:Q99873[11-371]
Residue:361
BDBM50095440
NameBDBM50095440
Synonyms:CHEMBL3589040
TypeSmall organic molecule
Emp. Form.C20H31N5O2
Mol. Mass.373.4924
SMILESCN(CCN)Cc1c[nH]nc1-c1ccc(OCCCN2CCOCC2)cc1