Reaction Details
TargetProtein arginine N-methyltransferase 1 [11-371]
LigandBDBM50095442
Substrate/Competitorn/a
Meas. Tech.ChEMBL_1504110 (CHEMBL3591484)
IC50 16±n/a nM
Citation Mitchell, LHDrew, AERibich, SARioux, NSwinger, KKJacques, SLLingaraj, TBoriack-Sjodin, PAWaters, NJWigle, TJMoradei, OJin, LRiera, TPorter-Scott, MMoyer, MPSmith, JJChesworth, RCopeland, RA Aryl Pyrazoles as Potent Inhibitors of Arginine Methyltransferases: Identification of the First PRMT6 Tool Compound. ACS Med Chem Lett6:655-9 (2015) 
 
Protein arginine N-methyltransferase 1 [11-371]
Name:Protein arginine N-methyltransferase 1 [11-371]
Type:Protein
Mol. Mass.:41506.52
Organism:Homo sapiens (Human)
Description:Q99873[11-371]
Residue:361
BDBM50095442
NameBDBM50095442
Synonyms:CHEMBL3589038
TypeSmall organic molecule
Emp. Form.C21H31F3N4O2
Mol. Mass.428.4916
SMILESCNCCN(C)Cc1cn[nH]c1-c1cc(OC(CO)CC(C)C)cc(c1)C(F)(F)F