Reaction Details
TargetLysine-specific demethylase 3A
LigandBDBM50095448
Substrate/Competitorn/a
Meas. Tech.ChEMBL_1504146 (CHEMBL3591678)
IC50>100000±n/a nM
Citation Itoh, YSawada, HSuzuki, MTojo, TSasaki, RHasegawa, MMizukami, TSuzuki, T Identification of Jumonji AT-Rich Interactive Domain 1A Inhibitors and Their Effect on Cancer Cells. ACS Med Chem Lett6:665-70 (2015) 
 
Lysine-specific demethylase 3A
Name:Lysine-specific demethylase 3A
Type:PROTEIN
Mol. Mass.:147368.22
Organism:Homo sapiens (Human)
Description:Q9Y4C1
Residue:1321
BDBM50095448
NameBDBM50095448
Synonyms:CHEMBL3590430
TypeSmall organic molecule
Emp. Form.C18H36N2O4
Mol. Mass.344.4894
SMILESCCCCCCN(CCCC)CCCCC(=O)N(O)CCC(O)=O