Reaction Details
TargetLysine-specific demethylase 3A
LigandBDBM26106
Substrate/Competitorn/a
Meas. Tech.ChEMBL_1504146 (CHEMBL3591678)
IC50 569000±n/a nM
Citation Itoh, YSawada, HSuzuki, MTojo, TSasaki, RHasegawa, MMizukami, TSuzuki, T Identification of Jumonji AT-Rich Interactive Domain 1A Inhibitors and Their Effect on Cancer Cells. ACS Med Chem Lett6:665-70 (2015) 
 
Lysine-specific demethylase 3A
Name:Lysine-specific demethylase 3A
Type:PROTEIN
Mol. Mass.:147368.22
Organism:Homo sapiens (Human)
Description:Q9Y4C1
Residue:1321
BDBM26106
NameBDBM26106
Synonyms:CHEMBL90852 NOG [(carboxymethyl)carbamoyl]formic acid
TypeSmall organic molecule
Emp. Form.C4H5NO5
Mol. Mass.147.0862
SMILESOC(=O)CNC(=O)C(O)=O