Reaction Details
TargetPotassium voltage-gated channel subfamily H member 2
LigandBDBM50427984
Substrate/Competitorn/a
Meas. Tech.ChEMBL_1504608 (CHEMBL3591513)
Ki 3654±n/a nM
Citation Yu, Zvan Veldhoven, JPLouvel, J't Hart, IMRook, MBvan der Heyden, MAHeitman, LHIJzerman, AP Structure-Affinity Relationships (SARs) and Structure-Kinetics Relationships (SKRs) of Kv11.1 Blockers. J Med Chem58:5916-29 (2015) 
 
Potassium voltage-gated channel subfamily H member 2
Name:Potassium voltage-gated channel subfamily H member 2
Type:Multi-pass membrane protein
Mol. Mass.:126672.65
Organism:Homo sapiens (Human)
Description:Q12809
Residue:1159
BDBM50427984
NameBDBM50427984
Synonyms:CHEMBL2324257
TypeSmall organic molecule
Emp. Form.C23H23Cl2NO2
Mol. Mass.416.34
SMILESClc1ccc(OCCCc2cccc(CCCOc3ccc(Cl)cc3)n2)cc1