Reaction Details
TargetPotassium voltage-gated channel subfamily H member 2
LigandBDBM50427967
Substrate/Competitorn/a
Meas. Tech.ChEMBL_1504608 (CHEMBL3591513)
Ki 86±n/a nM
Citation Yu, Zvan Veldhoven, JPLouvel, J't Hart, IMRook, MBvan der Heyden, MAHeitman, LHIJzerman, AP Structure-Affinity Relationships (SARs) and Structure-Kinetics Relationships (SKRs) of Kv11.1 Blockers. J Med Chem58:5916-29 (2015) 
 
Potassium voltage-gated channel subfamily H member 2
Name:Potassium voltage-gated channel subfamily H member 2
Type:Multi-pass membrane protein
Mol. Mass.:126672.65
Organism:Homo sapiens (Human)
Description:Q12809
Residue:1159
BDBM50427967
NameBDBM50427967
Synonyms:CHEMBL2325212
TypeSmall organic molecule
Emp. Form.C34H24N
Mol. Mass.446.5605
SMILESC[n+]1c(cccc1C#Cc1ccc(cc1)-c1ccccc1)C#Cc1ccc(cc1)-c1ccccc1