Reaction Details
TargetPotassium voltage-gated channel subfamily H member 2
LigandBDBM50095796
Substrate/Competitorn/a
Meas. Tech.ChEMBL_1504608 (CHEMBL3591513)
Ki 176±n/a nM
Citation Yu, Zvan Veldhoven, JPLouvel, J't Hart, IMRook, MBvan der Heyden, MAHeitman, LHIJzerman, AP Structure-Affinity Relationships (SARs) and Structure-Kinetics Relationships (SKRs) of Kv11.1 Blockers. J Med Chem58:5916-29 (2015) 
 
Potassium voltage-gated channel subfamily H member 2
Name:Potassium voltage-gated channel subfamily H member 2
Type:Multi-pass membrane protein
Mol. Mass.:126672.65
Organism:Homo sapiens (Human)
Description:Q12809
Residue:1159
BDBM50095796
NameBDBM50095796
Synonyms:CHEMBL3590496
TypeSmall organic molecule
Emp. Form.C37H28F3NO5S
Mol. Mass.655.682
SMILES[O-]S(=O)(=O)C(F)(F)F.COc1cccc(c1)-c1ccc(cc1)C#Cc1cccc(C#Cc2ccc(cc2)-c2cccc(OC)c2)[n+]1C