Reaction Details
TargetPotassium voltage-gated channel subfamily H member 2
LigandBDBM50095642
Substrate/Competitorn/a
Meas. Tech.ChEMBL_1504611 (CHEMBL3591516)
Kd 3.0±n/a nM
Citation Yu, Zvan Veldhoven, JPLouvel, J't Hart, IMRook, MBvan der Heyden, MAHeitman, LHIJzerman, AP Structure-Affinity Relationships (SARs) and Structure-Kinetics Relationships (SKRs) of Kv11.1 Blockers. J Med Chem58:5916-29 (2015) 
 
Potassium voltage-gated channel subfamily H member 2
Name:Potassium voltage-gated channel subfamily H member 2
Type:Multi-pass membrane protein
Mol. Mass.:126672.65
Organism:Homo sapiens (Human)
Description:Q12809
Residue:1159
BDBM50095642
NameBDBM50095642
Synonyms:CHEMBL3590446
TypeSmall organic molecule
Emp. Form.C18H21N3O5
Mol. Mass.359.3764
SMILESCCN(CCOc1ccc(cc1)[N+]([O-])=O)CCc1ccc(cc1)[N+]([O-])=O