Reaction Details
TargetPotassium voltage-gated channel subfamily H member 2
LigandBDBM50095651
Substrate/Competitorn/a
Meas. Tech.ChEMBL_1504611 (CHEMBL3591516)
Kd 247±n/a nM
Citation Yu, Zvan Veldhoven, JPLouvel, J't Hart, IMRook, MBvan der Heyden, MAHeitman, LHIJzerman, AP Structure-Affinity Relationships (SARs) and Structure-Kinetics Relationships (SKRs) of Kv11.1 Blockers. J Med Chem58:5916-29 (2015) 
 
Potassium voltage-gated channel subfamily H member 2
Name:Potassium voltage-gated channel subfamily H member 2
Type:Multi-pass membrane protein
Mol. Mass.:126672.65
Organism:Homo sapiens (Human)
Description:Q12809
Residue:1159
BDBM50095651
NameBDBM50095651
Synonyms:CHEMBL3590451
TypeSmall organic molecule
Emp. Form.C18H16F3N3O6
Mol. Mass.427.3313
SMILES[O-][N+](=O)c1ccc(CCN(CCOc2ccc(cc2)[N+]([O-])=O)C(=O)C(F)(F)F)cc1