Reaction Details
TargetPotassium voltage-gated channel subfamily H member 2
LigandBDBM50427961
Substrate/Competitorn/a
Meas. Tech.ChEMBL_1504611 (CHEMBL3591516)
Kd 8877±n/a nM
Citation Yu, Zvan Veldhoven, JPLouvel, J't Hart, IMRook, MBvan der Heyden, MAHeitman, LHIJzerman, AP Structure-Affinity Relationships (SARs) and Structure-Kinetics Relationships (SKRs) of Kv11.1 Blockers. J Med Chem58:5916-29 (2015) 
 
Potassium voltage-gated channel subfamily H member 2
Name:Potassium voltage-gated channel subfamily H member 2
Type:Multi-pass membrane protein
Mol. Mass.:126672.65
Organism:Homo sapiens (Human)
Description:Q12809
Residue:1159
BDBM50427961
NameBDBM50427961
Synonyms:CHEMBL2324239
TypeSmall organic molecule
Emp. Form.C24H18Cl2NO2
Mol. Mass.423.311
SMILESC[n+]1c(cccc1C#CCOc1ccc(Cl)cc1)C#CCOc1ccc(Cl)cc1