Reaction Details
TargetPotassium voltage-gated channel subfamily H member 2
LigandBDBM50095834
Substrate/Competitorn/a
Meas. Tech.ChEMBL_1504611 (CHEMBL3591516)
Kd 100±n/a nM
Citation Yu, Zvan Veldhoven, JPLouvel, J't Hart, IMRook, MBvan der Heyden, MAHeitman, LHIJzerman, AP Structure-Affinity Relationships (SARs) and Structure-Kinetics Relationships (SKRs) of Kv11.1 Blockers. J Med Chem58:5916-29 (2015) 
 
Potassium voltage-gated channel subfamily H member 2
Name:Potassium voltage-gated channel subfamily H member 2
Type:Multi-pass membrane protein
Mol. Mass.:126672.65
Organism:Homo sapiens (Human)
Description:Q12809
Residue:1159
BDBM50095834
NameBDBM50095834
Synonyms:CHEMBL3590501
TypeSmall organic molecule
Emp. Form.C35H22Cl2F3NO3S
Mol. Mass.664.52
SMILES[O-]S(=O)(=O)C(F)(F)F.C[n+]1c(cccc1C#Cc1ccc(cc1)-c1ccc(Cl)cc1)C#Cc1ccc(cc1)-c1ccc(Cl)cc1