Reaction Details
TargetCannabinoid receptor 2
LigandBDBM50211843
Substrate/Competitorn/a
Meas. Tech.ChEMBL_1502230 (CHEMBL3591166)
EC50 437±n/a nM
Citation Han, SZhang, FFQian, HYChen, LLPu, JBXie, XChen, JZ Development of Quinoline-2,4(1H,3H)-diones as Potent and Selective Ligands of the Cannabinoid Type 2 Receptor. J Med Chem58:5751-69 (2015) 
 
Cannabinoid receptor 2
Name:Cannabinoid receptor 2
Type:G Protein-Coupled Receptor (GPCR)
Mol. Mass.:39690.94
Organism:Homo sapiens (Human)
Description:P34972
Residue:360
BDBM50211843
NameBDBM50211843
Synonyms:2-(2,4-dichlorophenylamino)-4-trifluoromethyl-pyrimidine-5-carboxylic acid N-(tetrahydropyran-4-ylmethyl)amide CHEMBL225411 GW-842166X
TypeSmall organic molecule
Emp. Form.C18H17Cl2F3N4O2
Mol. Mass.449.254
SMILESFC(F)(F)c1nc(Nc2ccc(Cl)cc2Cl)ncc1C(=O)NCC1CCOCC1