Reaction Details
TargetCannabinoid receptor 2
LigandBDBM50095868
Substrate/Competitorn/a
Meas. Tech.ChEMBL_1502230 (CHEMBL3591166)
EC50 104±n/a nM
Citation Han, SZhang, FFQian, HYChen, LLPu, JBXie, XChen, JZ Development of Quinoline-2,4(1H,3H)-diones as Potent and Selective Ligands of the Cannabinoid Type 2 Receptor. J Med Chem58:5751-69 (2015) 
 
Cannabinoid receptor 2
Name:Cannabinoid receptor 2
Type:G Protein-Coupled Receptor (GPCR)
Mol. Mass.:39690.94
Organism:Homo sapiens (Human)
Description:P34972
Residue:360
BDBM50095868
NameBDBM50095868
Synonyms:CHEMBL3588878
TypeSmall organic molecule
Emp. Form.C19H24N2O2
Mol. Mass.312.4061
SMILESCc1cccc2C(=O)\C(=C/NC(C)(C)C)C(=O)N(CC3CC3)c12