Reaction Details
TargetCannabinoid receptor 2
LigandBDBM50095884
Substrate/Competitorn/a
Meas. Tech.ChEMBL_1502234 (CHEMBL3591170)
IC50>10000±n/a nM
Citation Han, SZhang, FFQian, HYChen, LLPu, JBXie, XChen, JZ Development of Quinoline-2,4(1H,3H)-diones as Potent and Selective Ligands of the Cannabinoid Type 2 Receptor. J Med Chem58:5751-69 (2015) 
 
Cannabinoid receptor 2
Name:Cannabinoid receptor 2
Type:G Protein-Coupled Receptor (GPCR)
Mol. Mass.:39690.94
Organism:Homo sapiens (Human)
Description:P34972
Residue:360
BDBM50095884
NameBDBM50095884
Synonyms:CHEMBL3590644
TypeSmall organic molecule
Emp. Form.C25H36N2O2
Mol. Mass.396.5655
SMILESCCCCCN1C(=O)\C(=C\NC2CCCCC2)C(=O)c2cc(ccc12)C(C)(C)C