Reaction Details
TargetCannabinoid receptor 2
LigandBDBM50095898
Substrate/Competitorn/a
Meas. Tech.ChEMBL_1502234 (CHEMBL3591170)
IC50 1480±n/a nM
Citation Han, SZhang, FFQian, HYChen, LLPu, JBXie, XChen, JZ Development of Quinoline-2,4(1H,3H)-diones as Potent and Selective Ligands of the Cannabinoid Type 2 Receptor. J Med Chem58:5751-69 (2015) 
 
Cannabinoid receptor 2
Name:Cannabinoid receptor 2
Type:G Protein-Coupled Receptor (GPCR)
Mol. Mass.:39690.94
Organism:Homo sapiens (Human)
Description:P34972
Residue:360
BDBM50095898
NameBDBM50095898
Synonyms:CHEMBL3590294
TypeSmall organic molecule
Emp. Form.C22H29ClN2O2
Mol. Mass.388.931
SMILESCCCCCN1C(=O)\C(=C\NC2CCCCC2)C(=O)c2cc(Cl)cc(C)c12