Reaction Details
TargetCannabinoid receptor 2
LigandBDBM21278
Substrate/Competitorn/a
Meas. Tech.ChEMBL_1502234 (CHEMBL3591170)
IC50 9100±n/a nM
Citation Han, SZhang, FFQian, HYChen, LLPu, JBXie, XChen, JZ Development of Quinoline-2,4(1H,3H)-diones as Potent and Selective Ligands of the Cannabinoid Type 2 Receptor. J Med Chem58:5751-69 (2015) 
 
Cannabinoid receptor 2
Name:Cannabinoid receptor 2
Type:G Protein-Coupled Receptor (GPCR)
Mol. Mass.:39690.94
Organism:Homo sapiens (Human)
Description:P34972
Residue:360
BDBM21278
NameBDBM21278
Synonyms:5-(4-chlorophenyl)-1-(2,4-dichlorophenyl)-4-methyl-N-(piperidin-1-yl)-1H-pyrazole-3-carboxamide CHEMBL111 RIMONABANT HYDROCHLORIDE SR 141716A SR141716A [3H]SR141716A
TypeSmall organic molecule
Emp. Form.C22H21Cl3N4O
Mol. Mass.463.787
SMILESCc1c(nn(c1-c1ccc(Cl)cc1)-c1ccc(Cl)cc1Cl)C(=O)NN1CCCCC1