Reaction Details
TargetCannabinoid receptor 1
LigandBDBM50095850
Substrate/Competitorn/a
Meas. Tech.ChEMBL_1502229 (CHEMBL3591165)
EC50>10000±n/a nM
Citation Han, SZhang, FFQian, HYChen, LLPu, JBXie, XChen, JZ Development of Quinoline-2,4(1H,3H)-diones as Potent and Selective Ligands of the Cannabinoid Type 2 Receptor. J Med Chem58:5751-69 (2015) 
 
Cannabinoid receptor 1
Name:Cannabinoid receptor 1
Type:G Protein-Coupled Receptor (GPCR)
Mol. Mass.:52868.96
Organism:Homo sapiens (Human)
Description:P21554
Residue:472
BDBM50095850
NameBDBM50095850
Synonyms:CHEMBL3590624
TypeSmall organic molecule
Emp. Form.C20H26N2O2
Mol. Mass.326.4326
SMILESCCCCN1C(=O)\C(=C\NCC2CCC2)C(=O)c2cccc(C)c12