Reaction Details
TargetCannabinoid receptor 1
LigandBDBM50095855
Substrate/Competitorn/a
Meas. Tech.ChEMBL_1502229 (CHEMBL3591165)
EC50>10000±n/a nM
Citation Han, SZhang, FFQian, HYChen, LLPu, JBXie, XChen, JZ Development of Quinoline-2,4(1H,3H)-diones as Potent and Selective Ligands of the Cannabinoid Type 2 Receptor. J Med Chem58:5751-69 (2015) 
 
Cannabinoid receptor 1
Name:Cannabinoid receptor 1
Type:G Protein-Coupled Receptor (GPCR)
Mol. Mass.:52868.96
Organism:Homo sapiens (Human)
Description:P21554
Residue:472
BDBM50095855
NameBDBM50095855
Synonyms:CHEMBL3590619
TypeSmall organic molecule
Emp. Form.C21H21FN2O2
Mol. Mass.352.402
SMILESCCCCN1C(=O)\C(=C\Nc2ccc(F)cc2)C(=O)c2cccc(C)c12