Reaction Details
TargetCannabinoid receptor 1
LigandBDBM50389925
Substrate/Competitorn/a
Meas. Tech.ChEMBL_1502797 (CHEMBL3591200)
EC50 440±n/a nM
Citation Cawston, EEConnor, MDi Marzo, VSilvestri, RGlass, M Distinct Temporal Fingerprint for Cyclic Adenosine Monophosphate (cAMP) Signaling of Indole-2-carboxamides as Allosteric Modulators of the Cannabinoid Receptors. J Med Chem58:5979-88 (2015) 
 
Cannabinoid receptor 1
Name:Cannabinoid receptor 1
Type:G Protein-Coupled Receptor (GPCR)
Mol. Mass.:52868.96
Organism:Homo sapiens (Human)
Description:P21554
Residue:472
BDBM50389925
NameBDBM50389925
Synonyms:CHEMBL2071060
TypeSmall organic molecule
Emp. Form.C19H18ClN3O3
Mol. Mass.371.818
SMILESCCc1c([nH]c2ccc(Cl)cc12)C(=O)NCCc1ccc(cc1)[N+]([O-])=O