Reaction Details
TargetCannabinoid receptor 1
LigandBDBM50072775
Substrate/Competitorn/a
Meas. Tech.ChEMBL_1502620 (CHEMBL3592881)
EC50 0.437000±n/a nM
Citation Cawston, EEConnor, MDi Marzo, VSilvestri, RGlass, M Distinct Temporal Fingerprint for Cyclic Adenosine Monophosphate (cAMP) Signaling of Indole-2-carboxamides as Allosteric Modulators of the Cannabinoid Receptors. J Med Chem58:5979-88 (2015) 
 
Cannabinoid receptor 1
Name:Cannabinoid receptor 1
Type:G Protein-Coupled Receptor (GPCR)
Mol. Mass.:52868.96
Organism:Homo sapiens (Human)
Description:P21554
Residue:472
BDBM50072775
NameBDBM50072775
Synonyms:2-((1R,2R,5R)-5-hydroxy-2-(3-hydroxypropyl)cyclohexyl)-5-(2-methyloctan-2-yl)phenol 5-(1,1-Dimethyl-heptyl)-2-[(4R,6R)-5-hydroxy-2-((R)-3-hydroxy-propyl)-cyclohexyl]-phenol CP-55940 CP55,940 ChEMBL_75020
TypeSmall organic molecule
Emp. Form.C24H40O3
Mol. Mass.376.5726
SMILESCCCCCCC(C)(C)c1ccc([C@@H]2C[C@H](O)CC[C@H]2CCCO)c(O)c1