Reaction Details
TargetCannabinoid receptor 2
LigandBDBM50389940
Substrate/Competitorn/a
Meas. Tech.ChEMBL_1502804 (CHEMBL3591207)
EC50 130±n/a nM
Citation Cawston, EEConnor, MDi Marzo, VSilvestri, RGlass, M Distinct Temporal Fingerprint for Cyclic Adenosine Monophosphate (cAMP) Signaling of Indole-2-carboxamides as Allosteric Modulators of the Cannabinoid Receptors. J Med Chem58:5979-88 (2015) 
 
Cannabinoid receptor 2
Name:Cannabinoid receptor 2
Type:G Protein-Coupled Receptor (GPCR)
Mol. Mass.:39690.94
Organism:Homo sapiens (Human)
Description:P34972
Residue:360
BDBM50389940
NameBDBM50389940
Synonyms:CHEMBL2071055
TypeSmall organic molecule
Emp. Form.C24H27ClN2O2
Mol. Mass.410.936
SMILESCCc1c([nH]c2ccc(Cl)cc12)C(=O)OCCc1ccc(cc1)N1CCCCC1