Reaction Details
TargetCannabinoid receptor 1
LigandBDBM50389929
Substrate/Competitorn/a
Meas. Tech.ChEMBL_1502795 (CHEMBL3591198)
EC50 1010±n/a nM
Citation Cawston, EEConnor, MDi Marzo, VSilvestri, RGlass, M Distinct Temporal Fingerprint for Cyclic Adenosine Monophosphate (cAMP) Signaling of Indole-2-carboxamides as Allosteric Modulators of the Cannabinoid Receptors. J Med Chem58:5979-88 (2015) 
 
Cannabinoid receptor 1
Name:Cannabinoid receptor 1
Type:G Protein-Coupled Receptor (GPCR)
Mol. Mass.:52868.96
Organism:Homo sapiens (Human)
Description:P21554
Residue:472
BDBM50389929
NameBDBM50389929
Synonyms:CHEMBL2071064
TypeSmall organic molecule
Emp. Form.C20H21ClN2O
Mol. Mass.340.847
SMILESCCc1c([nH]c2ccc(Cl)cc12)C(=O)NCCc1ccc(C)cc1